webentwicklung-frage-antwort-db.com.de

configure: Fehler: C-Compiler kann keine ausführbaren Dateien erstellen

Ich habe eine Reihe ähnlicher Fragen zu stackoverflow geprüft, aber noch keine Antwort gefunden.

Ich versuche, memcached auf Lion OSX als hier gezeigt zu installieren.

Folgendes bekomme ich:

j-court-demones-macbook-pro:libevent-1.4.12-stable jcourtdemone$ ./configure; make
checking for a BSD-compatible install... /usr/bin/install -c
checking whether build environment is sane... yes
checking for a thread-safe mkdir -p... ./install-sh -c -d
checking for gawk... no
checking for mawk... no
checking for nawk... no
checking for awk... awk
checking whether make sets $(MAKE)... yes
checking for gcc... gcc
checking for C compiler default output file name... 
configure: error: in `/tmp/libevent-1.4.12-stable':
configure: error: C compiler cannot create executables
See `config.log' for more details.
make: *** No targets specified and no makefile found.  Stop.

Ich habe Xcode neu installiert, wie es an einigen Stellen empfohlen wurde, aber keine Würfel.

Hier ist meine config.log:

This file contains any messages produced by compilers while
running configure, to aid debugging if configure makes a mistake.

It was created by configure, which was
generated by GNU Autoconf 2.63.  Invocation command line was

  $ ./configure 

## --------- ##
## Platform. ##
## --------- ##

hostname = j-court-demones-macbook-pro.local
uname -m = x86_64
uname -r = 11.3.0
uname -s = Darwin
uname -v = Darwin Kernel Version 11.3.0: Thu Jan 12 18:47:41 PST 2012; root:xnu-1699.24.23~1/RELEASE_X86_64

/usr/bin/uname -p = i386
/bin/uname -X     = unknown

/bin/Arch              = unknown
/usr/bin/Arch -k       = unknown
/usr/convex/getsysinfo = unknown
/usr/bin/hostinfo      = Mach kernel version:
     Darwin Kernel Version 11.3.0: Thu Jan 12 18:47:41 PST 2012; root:xnu-1699.24.23~1/RELEASE_X86_64
Kernel configured for up to 8 processors.
4 processors are physically available.
8 processors are logically available.
Processor type: i486 (Intel 80486)
Processors active: 0 1 2 3 4 5 6 7
Primary memory available: 4.00 gigabytes
Default processor set: 109 tasks, 599 threads, 8 processors
Load average: 0.98, Mach factor: 7.01
/bin/machine           = unknown
/usr/bin/oslevel       = unknown
/bin/universe          = unknown

PATH: /opt/local/bin
PATH: /opt/local/sbin
PATH: /opt/local/bin
PATH: /opt/local/sbin
PATH: /usr/bin
PATH: /Developer/usr/bin
PATH: /usr/bin
PATH: /bin
PATH: /usr/sbin
PATH: /sbin
PATH: /usr/local/bin
PATH: /usr/X11/bin


## ----------- ##
## Core tests. ##
## ----------- ##

configure:2077: checking for a BSD-compatible install
configure:2145: result: /usr/bin/install -c
configure:2156: checking whether build environment is sane
configure:2199: result: yes
configure:2224: checking for a thread-safe mkdir -p
configure:2263: result: ./install-sh -c -d
configure:2276: checking for gawk
configure:2306: result: no
configure:2276: checking for mawk
configure:2306: result: no
configure:2276: checking for nawk
configure:2306: result: no
configure:2276: checking for awk
configure:2292: found /usr/bin/awk
configure:2303: result: awk
configure:2314: checking whether make sets $(MAKE)
configure:2336: result: yes
configure:2575: checking for gcc
configure:2591: found /Developer/usr/bin/gcc
configure:2602: result: gcc
configure:2834: checking for C compiler version
configure:2842: gcc --version >&5
i686-Apple-darwin9-gcc-4.0.1 (GCC) 4.0.1 (Apple Inc. build 5484)
Copyright (C) 2005 Free Software Foundation, Inc.
This is free software; see the source for copying conditions.  There is NO
warranty; not even for MERCHANTABILITY or FITNESS FOR A PARTICULAR PURPOSE.

configure:2846: $? = 0
configure:2853: gcc -v >&5
Using built-in specs.
Target: i686-Apple-darwin9
Configured with: /var/tmp/gcc/gcc-5484~1/src/configure --disable-checking -enable-werror --prefix=/usr --mandir=/share/man --enable-languages=c,objc,c++,obj-c++ --program-transform-name=/^[cg][^.-]*$/s/$/-4.0/ --with-gxx-include-dir=/include/c++/4.0.0 --with-slibdir=/usr/lib --build=i686-Apple-darwin9 --with-Arch=Apple --with-tune=generic --Host=i686-Apple-darwin9 --target=i686-Apple-darwin9
Thread model: posix
gcc version 4.0.1 (Apple Inc. build 5484)
configure:2857: $? = 0
configure:2864: gcc -V >&5
gcc-4.0: argument to `-V' is missing
configure:2868: $? = 1
configure:2891: checking for C compiler default output file name
configure:2913: gcc    conftest.c  >&5
ld: library not found for -lcrt1.10.5.o
collect2: ld returned 1 exit status
configure:2917: $? = 1
configure:2955: result: 
configure: failed program was:
| /* confdefs.h.  */
| #define PACKAGE_NAME ""
| #define PACKAGE_TARNAME ""
| #define PACKAGE_VERSION ""
| #define PACKAGE_STRING ""
| #define PACKAGE_BUGREPORT ""
| #define PACKAGE "libevent"
| #define VERSION "1.4.12-stable"
| /* end confdefs.h.  */
| 
| int
| main ()
| {
| 
|   ;
|   return 0;
| }
configure:2961: error: in `/tmp/libevent-1.4.12-stable':
configure:2964: error: C compiler cannot create executables
See `config.log' for more details.

## ---------------- ##
## Cache variables. ##
## ---------------- ##

ac_cv_env_CCC_set=
ac_cv_env_CCC_value=
ac_cv_env_CC_set=
ac_cv_env_CC_value=
ac_cv_env_CFLAGS_set=
ac_cv_env_CFLAGS_value=
ac_cv_env_CPPFLAGS_set=
ac_cv_env_CPPFLAGS_value=
ac_cv_env_CPP_set=
ac_cv_env_CPP_value=
ac_cv_env_CXXCPP_set=
ac_cv_env_CXXCPP_value=
ac_cv_env_CXXFLAGS_set=
ac_cv_env_CXXFLAGS_value=
ac_cv_env_CXX_set=
ac_cv_env_CXX_value=
ac_cv_env_F77_set=
ac_cv_env_F77_value=
ac_cv_env_FFLAGS_set=
ac_cv_env_FFLAGS_value=
ac_cv_env_LDFLAGS_set=
ac_cv_env_LDFLAGS_value=
ac_cv_env_LIBS_set=
ac_cv_env_LIBS_value=
ac_cv_env_build_alias_set=
ac_cv_env_build_alias_value=
ac_cv_env_Host_alias_set=
ac_cv_env_Host_alias_value=
ac_cv_env_target_alias_set=
ac_cv_env_target_alias_value=
ac_cv_path_install='/usr/bin/install -c'
ac_cv_prog_AWK=awk
ac_cv_prog_ac_ct_CC=gcc
ac_cv_prog_make_make_set=yes

## ----------------- ##
## Output variables. ##
## ----------------- ##

ACLOCAL='${Shell} /tmp/libevent-1.4.12-stable/missing --run aclocal-1.10'
AMDEPBACKSLASH=''
AMDEP_FALSE=''
AMDEP_TRUE=''
AMTAR='${Shell} /tmp/libevent-1.4.12-stable/missing --run tar'
AR=''
AUTOCONF='${Shell} /tmp/libevent-1.4.12-stable/missing --run autoconf'
AUTOHEADER='${Shell} /tmp/libevent-1.4.12-stable/missing --run autoheader'
AUTOMAKE='${Shell} /tmp/libevent-1.4.12-stable/missing --run automake-1.10'
AWK='awk'
BUILD_WIN32_FALSE=''
BUILD_WIN32_TRUE=''
CC='gcc'
CCDEPMODE=''
CFLAGS=''
CPP=''
CPPFLAGS=''
CXX=''
CXXCPP=''
CXXDEPMODE=''
CXXFLAGS=''
CYGPATH_W='echo'
DEFS=''
DEPDIR=''
DSYMUTIL=''
ECHO='/bin/echo'
ECHO_C='\c'
ECHO_N=''
ECHO_T=''
EGREP=''
EXEEXT=''
F77=''
FFLAGS=''
GREP=''
INSTALL_DATA='${INSTALL} -m 644'
INSTALL_PROGRAM='${INSTALL}'
INSTALL_SCRIPT='${INSTALL}'
INSTALL_STRIP_PROGRAM='$(install_sh) -c -s'
LDFLAGS=''
LIBOBJS=''
LIBS=''
LIBTOOL=''
LIBTOOL_DEPS=''
LN_S=''
LTLIBOBJS=''
MAKEINFO='${Shell} /tmp/libevent-1.4.12-stable/missing --run makeinfo'
MKDIR_P='./install-sh -c -d'
NMEDIT=''
OBJEXT=''
PACKAGE='libevent'
PACKAGE_BUGREPORT=''
PACKAGE_NAME=''
PACKAGE_STRING=''
PACKAGE_TARNAME=''
PACKAGE_VERSION=''
PATH_SEPARATOR=':'
RANLIB=''
SED=''
SET_MAKE=''
Shell='/bin/sh'
STRIP=''
VERSION='1.4.12-stable'
ac_ct_CC='gcc'
ac_ct_CXX=''
ac_ct_F77=''
am__fastdepCC_FALSE=''
am__fastdepCC_TRUE=''
am__fastdepCXX_FALSE=''
am__fastdepCXX_TRUE=''
am__include=''
am__isrc=''
am__leading_dot='.'
am__quote=''
am__tar='${AMTAR} chof - "$$tardir"'
am__untar='${AMTAR} xf -'
bindir='${exec_prefix}/bin'
build=''
build_alias=''
build_cpu=''
build_os=''
build_vendor=''
datadir='${datarootdir}'
datarootdir='${prefix}/share'
docdir='${datarootdir}/doc/${PACKAGE}'
dvidir='${docdir}'
exec_prefix='NONE'
Host=''
Host_alias=''
Host_cpu=''
Host_os=''
Host_vendor=''
htmldir='${docdir}'
includedir='${prefix}/include'
infodir='${datarootdir}/info'
install_sh='$(Shell) /tmp/libevent-1.4.12-stable/install-sh'
libdir='${exec_prefix}/lib'
libexecdir='${exec_prefix}/libexec'
localedir='${datarootdir}/locale'
localstatedir='${prefix}/var'
mandir='${datarootdir}/man'
mkdir_p='$(top_builddir)/./install-sh -c -d'
oldincludedir='/usr/include'
pdfdir='${docdir}'
prefix='/usr/local'
program_transform_name='s,x,x,'
psdir='${docdir}'
sbindir='${exec_prefix}/sbin'
sharedstatedir='${prefix}/com'
sysconfdir='${prefix}/etc'
target_alias=''

## ----------- ##
## confdefs.h. ##
## ----------- ##

#define PACKAGE_NAME ""
#define PACKAGE_TARNAME ""
#define PACKAGE_VERSION ""
#define PACKAGE_STRING ""
#define PACKAGE_BUGREPORT ""
#define PACKAGE "libevent"
#define VERSION "1.4.12-stable"

configure: exit 77
124
CourtDemone

Sie haben einen alten Satz von Entwicklertools. gcc meldet seine Version als 4.0.1. Dies kann bei der Migration von einer älteren Version des Betriebssystems übrig bleiben. Wenn Sie Xcode 4.3.x installiert haben, müssen Sie es starten, in den Voreinstellungen wechseln, die Registerkarte Downloads auswählen und neben dem Paket mit den Befehlszeilen-Tools auf "Installieren" klicken.

104
Ken Thomases

Ich habe 10.8 und Xcode 4.4 mit Befehlszeilentools installiert, und trotzdem wurde mir diese Fehlermeldung angezeigt. Anstatt Xcode neu zu installieren, bemerkte ich, dass es in meiner config.log zwei relevante Zeilen gab:

configure:5130: checking for C compiler version
configure:5139: /Applications/Xcode.app/Contents/Developer/Toolchains/OSX10.8.xctoolchain/usr/bin/cc --version >&5

Dieser Weg gab es für mich nicht. Stattdessen hatte ich:

/Applications/Xcode.app/Contents/Developer/Toolchains/XcodeDefault.xctoolchain

Der C-Compiler ("cc") befindet sich innerhalb dieses xctoolchain-Verzeichnisses. Ich habe einen symbolischen Link für OSX10.8.xctoolchain erstellt, der auf XcodeDefault.xctoolchain verweist, und das Problem wurde behoben. Nun kann das memcached-Installationsskript die Compilerversion finden und auf seinem Weg weitergehen.

cd /Applications/Xcode.app/Contents/Developer/Toolchains
Sudo ln -s XcodeDefault.xctoolchain OSX10.8.xctoolchain

Wie in den Kommentaren vorgeschlagen, können Sie, wenn Sie dieses Problem mit Yosemite (10.10) oder Mavericks (10.9) haben, den obigen Befehl symlink so aktualisieren, dass er auf diese bestimmte Version (OSX10.9.xctoolchain oder OSX10.10.xctoolchain) verweist.

138
stereoscott

Wenn Sie diese Fehlermeldung sehen, haben Sie möglicherweise die Xcode-Lizenzvereinbarung noch nicht nach einem Upgrade akzeptiert.

Stellen Sie zunächst sicher, dass Sie Ihre Befehlszeilentools aktualisiert haben:

$ xcode-select --install

Jetzt möchte Apple, dass Sie der Lizenz zustimmen, bevor Sie diese Tools verwenden können:

$ gcc
Agreeing to the Xcode/iOS license requires admin privileges, please re-run as root via Sudo.

$ Sudo gcc
You have not agreed to the Xcode license agreements. You must agree to both license agreements below in order to use Xcode.
[...]

Nachdem Sie es akzeptiert haben, funktionieren die Befehlszeilen-Tools wie erwartet.

67
konrad

Ich hatte gerade dieses Problem beim Aufbau von Apache. Die Lösung, die ich verwendete, war die gleiche wie bei Mostafa, ich musste 2 Variablen exportieren:

export CC=/Applications/Xcode.app/Contents/Developer/Toolchains/XcodeDefault.xctoolchain/usr/bin/cc
CPP='/Applications/Xcode.app/Contents/Developer/Toolchains/XcodeDefault.xctoolchain/usr/bin/cc -E'

Dies war ein Mac OSX Mavericks 

12
David Williams

Ich hatte die Kommandozeilen-Tools bereits in xcode installiert, doch meine fehlten immer noch: 

line 3619: /usr/bin/gcc-4.2: No such file or directory

Als ich which gcc eingegeben habe, wurde es zurückgegeben 

/usr/bin/gcc

Als ich gcc -v eingab, bekam ich ein paar Sachen 

..  
gcc version 4.2.1 (Based on Apple Inc. build 5658) (LLVM build 2336.11.00)

Also habe ich einen Symlink erstellt:

cd /usr/bin
Sudo ln -s gcc gcc-4.2

Und es hat funktioniert!

(Die Datei config.log befindet sich in dem Verzeichnis, in dem make versucht, etwas zu erstellen.)

12
Rimian

Für mich war es ein Problem mit gcc, hervorgehoben durch gcc -v. Es war an der Aktualisierung von Xcode vor kurzem diesem Beitrag sagte Sudo xcode-select -switch /Applications/Xcode.app, was das Problem behoben hat.

3
homerjam

Die Einstellung 'clang' als Compiler-Konfiguration sollte für mich funktionieren:

export CC=clang
pip install --no-clean pycrypto
3
yndolok

Ich habe die ganze Seite wütend gelesen und hoffte, eine Lösung für Folgendes zu finden:

"configure: error: C compiler cannot create executables"

Am Ende funktionierte nichts, weil mein Problem ein "Tipp" war und mit CFLAGS ..__ verwandt war. In meiner .bash_profile-Datei hatte ich:

export ARM_Arch="arm64”
export CFLAGS="-Arch ${ARM_Arch}"

Wie Sie sehen können, exportieren Sie ARM_Arch = "arm64" ---. Das letzte Anführungszeichen stimmt nicht mit dem ersten Anführungszeichen überein. Das erste (") ist zulässig, das zweite (") ist zulässig nicht.
Dies geschah, weil ich den Fehler gemacht habe, TextEdit zu verwenden (ich arbeite unter MacOS), und dies ist anscheinend eine Funktion namens SmartQuotes: Das Anführungszeichen CHANGES BY ITSELF BEIM ILLEGAL STYLE, wenn Sie etwas daneben bearbeiten.
Lektion gelernt: Verwenden Sie einen geeigneten Texteditor ...

2
Florin Odagiu

Holen Sie sich zuerst den gcc-Pfad mit 

Befehl: welche gcc

Ausgabe:/usr/bin/gcc

Ich hatte das gleiche Problem. Setzen Sie den gcc-Pfad in den folgenden Befehl und installieren Sie ihn

CC =/usr/bin/gcc rvm installieren 1.9.3

Wenn Sie später "Ruby wurde ohne Dokumentation" erhalten, führen Sie den folgenden Befehl aus

rvm docs generate-ri

2
Gurudath BN

Wenn jemand hierher kommt, weil RVM/Ruby Probleme verursacht (Middleman/Grunt), habe ich mein Problem gelöst. 

PS. Die Antwort von steroscott hat mein Problem vor einiger Zeit behoben ... diesmal nicht der Fall.

In meinem Fall versucht rvm, ein heruntergeladenes Gcc via Homebrew zu verwenden. Ich habe eine Brew-Deinstallation von gcc (gcc46 für mich) ausgeführt und den Code für die Ruby-Installation erneut gelesen (altes Projekt, alter Ruby v).

$ brew uninstall gcc46

$ rvm install 1.9.3

während dieser Überprüfung der Anforderungen wurde automatisch ein neueres gcc für mich und den Boom abgerufen. Jetzt funktioniert alles. Oh, ein großer Hinweis, die Installation von gcc aus dem rvm-Befehl kann etwa 10-15 Minuten dauern, ohne dass Text ausgegeben wird. Es ist nicht eingefroren :) Viel Glück

2
jasonsemko

Vergewissern Sie sich, dass der Name der Xcode-Anwendung keine Leerzeichen enthält (dies kann passieren, wenn Sie ältere Versionen beibehalten, z. B. "Xcode 4.app" umbenennen). Build-Tools werden innerhalb der Xcode-Bundle-Pfade referenziert, und viele Skripts können Verweise mit Leerzeichen nicht richtig verarbeiten.

0
coderSeb

Über clang iOS Cross-Compiler

Ich habe festgestellt, dass das Problem bei miphoneos-version-min=5.0 lag. Ich habe in miphoneos-version-min=8.0 geändert. Jetzt gehts.

Ich möchte nur die Verwendung einer einfachen test.c-Datei vorschlagen und diese mit dem Befehl write in das Protokoll kompilieren.

0
Vyacheslav

In meinem Fall habe ich xcode-select --install ausprobiert, aber es gibt an, dass es nicht im Laden erhältlich ist. Dann, von Rimian inspiriert, überprüfte ich mein gcc: gcc -v und dann erhielt ich eine Nachricht, dass ich nicht zustimme.

Von diesem Punkt an habe ich gerade den Vereinbarungprozess von gcc -v gefolgt, nachdem ich zugestimmt hatte, dass es für mich gut funktioniert.

0
C-Rock