webentwicklung-frage-antwort-db.com.de

Verarbeiten Sie 'command'/Applications/Android Studio 3.0.1.app/Contents/jre/jdk/Contents/Home/bin/Java '' mit dem Exit-Wert 1, der nicht Null ist

Ich bin auf ein Problem gestoßen, als ich mit Android Studio ein Projekt importierte. Weitere Details: `` `

Error:Execution failed for task ':app:transformClassesWithDexForArmDebug'.
> com.Android.build.api.transform.TransformException: com.Android.ide.common.process.ProcessException: org.gradle.process.internal.ExecException: Process 'command '/Library/Java/JavaVirtualMachines/jdk1.8.0_161.jdk/Contents/Home/bin/Java'' finished with non-zero exit value 1
```

And the Gradle console show the following message:

---------
Executing tasks: [:app:assembleArmDebug]
Configuration on demand is an incubating feature.
:app:copyJniLibsArmDebugMainJniLibs UP-TO-DATE
:app:armDebug UP-TO-DATE
:app:preBuild UP-TO-DATE
:app:preArmDebugBuild UP-TO-DATE
:app:checkArmDebugManifest
:app:preArmReleaseBuild UP-TO-DATE
:app:prepareCjtLibraryWheelCamera019Library UP-TO-DATE
:app:prepareComAndroidSupportAnimatedVectorDrawable2531Library UP-TO-DATE
:app:prepareComAndroidSupportAppcompatV72531Library UP-TO-DATE
:app:prepareComAndroidSupportCardviewV72531Library UP-TO-DATE
:app:prepareComAndroidSupportDesign2531Library UP-TO-DATE
:app:preArmDebugAndroidTestBuild UP-TO-DATE
:app:prepareComAndroidSupportMultidex101Library UP-TO-DATE
:app:prepareComAndroidSupportRecyclerviewV72531Library UP-TO-DATE
:app:prepareComAndroidSupportSupportCompat2531Library UP-TO-DATE
:app:prepareComAndroidSupportSupportCoreUi2531Library UP-TO-DATE
:app:prepareComAndroidSupportSupportCoreUtils2531Library UP-TO-DATE
:app:prepareComAndroidSupportSupportFragment2531Library UP-TO-DATE
:app:prepareComAndroidSupportSupportMediaCompat2531Library UP-TO-DATE
:app:prepareComAndroidSupportSupportV42531Library UP-TO-DATE
:app:prepareComAndroidSupportSupportVectorDrawable2531Library UP-TO-DATE
:app:prepareComAndroidSupportTransition2531Library UP-TO-DATE
:app:prepareComBlankjUtilcode134Library UP-TO-DATE
:app:prepareComCjjMaterialrefeshlayoutLibrary130Library UP-TO-DATE
:app:prepareComDaimajiaAndroidanimationsLibrary113Library UP-TO-DATE
:app:prepareComDaimajiaEasingLibrary101Library UP-TO-DATE
:app:prepareComDanikulaVideocache264Library UP-TO-DATE
:app:prepareComDevbracketsAndroidExomedia301Library UP-TO-DATE
:app:prepareComEdmodoCropper101Library UP-TO-DATE
:app:prepareComFlycoTablayoutFlycoTabLayout_Lib212Library UP-TO-DATE
:app:prepareComGetbaseFloatingactionbutton1101Library UP-TO-DATE
:app:prepareComGithubChrisbanesPhotoView130Library UP-TO-DATE
:app:prepareComGithubCtiaoDanmakuFlameMaster0912Library UP-TO-DATE
:app:prepareComGithubJmolsmobileLandscapevideocamera107Library UP-TO-DATE
:app:prepareComGithubSatyanSugar15Library UP-TO-DATE
:app:prepareComGoogleAndroidExoplayerExoplayerR159Library UP-TO-DATE
:app:prepareComJaydenxiaoGuider100Library UP-TO-DATE
:app:prepareComJcodecraeerXrecyclerview132Library UP-TO-DATE
:app:prepareComMakeramenRoundedimageview230Library UP-TO-DATE
:app:prepareComMalinskiySuperrecyclerview114Library UP-TO-DATE
:app:prepareComOrhanobutLogger115Library UP-TO-DATE
:app:prepareComPgyersdkSdk254Library UP-TO-DATE
:app:prepareComPingxxPingppAlipay218Library UP-TO-DATE
:app:prepareComPingxxPingppCore218Library UP-TO-DATE
:app:prepareComPingxxPingppWxpay218Library UP-TO-DATE
:app:prepareComRengwuxianMaterialedittextLibrary214Library UP-TO-DATE
:app:prepareComScwangSmartrefreshSmartRefreshHeader103Library UP-TO-DATE
:app:prepareComScwangSmartrefreshSmartRefreshLayout103Library UP-TO-DATE
:app:prepareComSerenegiantCommon119Library UP-TO-DATE
:app:prepareComZhyOkhttputils262Library UP-TO-DATE
:app:prepareDeHdodenhofCircleimageview210Library UP-TO-DATE
:app:prepareJpWasabeefGlideTransformations202Library UP-TO-DATE
:app:preparePubDevrelEasypermissions020Library UP-TO-DATE
:app:prepareArmDebugDependencies
:app:compileArmDebugAidl UP-TO-DATE
:app:compileArmDebugRenderscript UP-TO-DATE
:app:generateArmDebugBuildConfig UP-TO-DATE
:app:generateArmDebugAssets UP-TO-DATE
:app:mergeArmDebugAssets UP-TO-DATE
:app:generateArmDebugResValues UP-TO-DATE
:app:generateArmDebugResources UP-TO-DATE
:app:mergeArmDebugResources UP-TO-DATE
:app:processArmDebugManifest UP-TO-DATE
:app:processArmDebugResources UP-TO-DATE
:app:generateArmDebugSources UP-TO-DATE
:app:compileArmDebugJavaWithJavac UP-TO-DATE
:app:compileArmDebugSources UP-TO-DATE
:app:transformClassesWithJarMergingForArmDebug UP-TO-DATE
:app:collectArmDebugMultiDexComponents UP-TO-DATE
:app:transformClassesWithMultidexlistForArmDebug UP-TO-DATE
:app:transformClassesWithDexForArmDebug

PARSE-FEHLER:

unsupported class file version 52.0
...while parsing com/a/a/a.class
PARSE ERROR:
unsupported class file version 52.0
...while parsing com/a/a/b.class
2 errors; aborting
 FAILED

    FAILURE: Build failed with an exception.
    * What went wrong:

Execution failed for task ':app:transformClassesWithDexForArmDebug'.

com.Android.build.api.transform.TransformException: com.Android.ide.common.process.ProcessException: org.gradle.process.internal.ExecException: Process 'command' /Library/Java/JavaVirtualMachines/jdk1.8.0_161. jdk/Contents/Home/bin/Java '' wurde mit dem Exit-Wert 1 ungleich Null beendet * Versuchen: Führen Sie die Option --stacktrace aus, um die Stack-Ablaufverfolgung abzurufen. Führen Sie die Option --info oder --debug aus, um weitere Protokollausgabe zu erhalten . BUILD FAILED Gesamtzeit: 39,744 Sekunden


Dieses Android-Projekt kann auf einem anderen Computer gut laufen, aber es kann nicht auf einem aktuellen Computer ausgeführt werden. Ich hoffe, Sie können mir helfen, dieses Problem zu lösen oder mir ein paar Vorschläge zu machen, danke im Voraus.

7
J.su

Fügen Sie diesen Code zu build.gradle> Android hinzu

dexOptions {
    javaMaxHeapSize "4g"
}
1
Pouriya Khalaj

Aktualisieren Sie Ihr Projekt build.gradle mit:

dependencies {
    classpath 'com.Android.tools.build:gradle:3.2.1'
}

und aktualisiere alle com.google.firebase und com.google.Android.gms in gradle datei auf neuere version.

1
Navneet Jain

Dieser Fehler bezieht sich auf die Abhängigkeiten von com.google.firebase und com.google.Android.gms.

Aktualisieren Sie sie auf ihre neueste Version, und das Problem wird behoben.

0

Ich habe gerade das gleiche Problem erlebt. Mein Fix war:

"build > Clean project"
"build > Generate signed APK"

Dann war der Build erfolgreich.

Ich hatte die DexOptions auch in mij build.gradle gesetzt.

dexOptions {
    javaMaxHeapSize "4g"
}
0
Bert Maurau