webentwicklung-frage-antwort-db.com.de

Native Reaction Fehler beim Erfassen des Snapshots der Eingabedateien für Task 'bundleReleaseJsAndAssets' während der aktuellen Überprüfung

Ich versuche, eine signierte APK-Datei für meine native React-App zu generieren (über das Ausführen von ./gradlew assembleRelease). Ich habe jedoch den folgenden Fehler:

FAILURE: Build failed with an exception.

* What went wrong:
Failed to capture snapshot of input files for task 'bundleReleaseJsAndAssets' during up-to-date check.
> Java.io.FileNotFoundException: /home/mohammad/superexnews/metro-bundler-symbolicate117830-24506-1aaqyox.dr9.sock (No such device or address)

* Try:
Run with --stacktrace option to get the stack trace. Run with --info or --debug option to get more log output.

BUILD FAILED

Hier ist es mit der Stacktrace-Option: 

Incremental Java compilation is an incubating feature.
:app:preBuild UP-TO-DATE
:app:preReleaseBuild UP-TO-DATE
:app:checkReleaseManifest
:app:preDebugBuild UP-TO-DATE
:app:prepareComAndroidSupportAppcompatV72301Library UP-TO-DATE
:app:prepareComAndroidSupportSupportV42301Library UP-TO-DATE
:app:prepareComFacebookFbuiTextlayoutbuilderTextlayoutbuilder100Library UP-TO-DATE
:app:prepareComFacebookFrescoDrawee130Library UP-TO-DATE
:app:prepareComFacebookFrescoFbcore130Library UP-TO-DATE
:app:prepareComFacebookFrescoFresco130Library UP-TO-DATE
:app:prepareComFacebookFrescoImagepipeline130Library UP-TO-DATE
:app:prepareComFacebookFrescoImagepipelineBase130Library UP-TO-DATE
:app:prepareComFacebookFrescoImagepipelineOkhttp3130Library UP-TO-DATE
:app:prepareComFacebookReactReactNative0484Library UP-TO-DATE
:app:prepareComFacebookSoloaderSoloader010Library UP-TO-DATE
:app:prepareOrgWebkitAndroidJscR174650Library UP-TO-DATE
:app:prepareReleaseDependencies
:app:compileReleaseAidl UP-TO-DATE
:app:compileReleaseRenderscript UP-TO-DATE
:app:generateReleaseBuildConfig UP-TO-DATE
:app:mergeReleaseShaders UP-TO-DATE
:app:compileReleaseShaders UP-TO-DATE
:app:generateReleaseAssets UP-TO-DATE
:app:mergeReleaseAssets UP-TO-DATE
:app:generateReleaseResValues UP-TO-DATE
:app:generateReleaseResources UP-TO-DATE
:app:mergeReleaseResources UP-TO-DATE
:app:bundleReleaseJsAndAssets

FAILURE: Build failed with an exception.

* What went wrong:
Failed to capture snapshot of input files for task 'bundleReleaseJsAndAssets' during up-to-date check.
> Java.io.FileNotFoundException: /home/mohammad/superexnews/metro-bundler-symbolicate117830-24506-1aaqyox.dr9.sock (No such device or address)

* Try:
Run with --info or --debug option to get more log output.

* Exception is:
org.gradle.api.UncheckedIOException: Failed to capture snapshot of input files for task 'bundleReleaseJsAndAssets' during up-to-date check.
        at org.gradle.api.internal.changedetection.rules.AbstractFileSnapshotTaskStateChanges.createSnapshot(AbstractFileSnapshotTaskStateChanges.Java:57)
        at org.gradle.api.internal.changedetection.rules.InputFilesTaskStateChanges.getCurrent(InputFilesTaskStateChanges.Java:52)
        at org.gradle.api.internal.changedetection.rules.AbstractFileSnapshotTaskStateChanges.getChanges(AbstractFileSnapshotTaskStateChanges.Java:42)
        at org.gradle.api.internal.changedetection.rules.AbstractFileSnapshotTaskStateChanges$1.<init>(AbstractFileSnapshotTaskStateChanges.Java:71)
        at org.gradle.api.internal.changedetection.rules.AbstractFileSnapshotTaskStateChanges.iterator(AbstractFileSnapshotTaskStateChanges.Java:70)
        at org.gradle.api.internal.changedetection.rules.InputFilesTaskStateChanges.iterator(InputFilesTaskStateChanges.Java:68)
        at org.gradle.api.internal.changedetection.rules.CachingTaskStateChanges.reset(CachingTaskStateChanges.Java:79)
        at org.gradle.api.internal.changedetection.rules.CachingTaskStateChanges.iterator(CachingTaskStateChanges.Java:44)
        at org.gradle.api.internal.changedetection.rules.SummaryTaskStateChanges.firstDirtyIterator(SummaryTaskStateChanges.Java:63)
        at org.gradle.api.internal.changedetection.rules.SummaryTaskStateChanges.access$000(SummaryTaskStateChanges.Java:25)
        at org.gradle.api.internal.changedetection.rules.SummaryTaskStateChanges$1.computeNext(SummaryTaskStateChanges.Java:49)
        at org.gradle.api.internal.changedetection.rules.SummaryTaskStateChanges$1.computeNext(SummaryTaskStateChanges.Java:42)
        at com.google.common.collect.AbstractIterator.tryToComputeNext(AbstractIterator.Java:143)
        at com.google.common.collect.AbstractIterator.hasNext(AbstractIterator.Java:138)
        at org.gradle.api.internal.changedetection.changes.DefaultTaskArtifactStateRepository$TaskArtifactStateImpl.collectChangedMessages(DefaultTaskArtifactStateRepository.Java:83)
        at org.gradle.api.internal.changedetection.changes.DefaultTaskArtifactStateRepository$TaskArtifactStateImpl.isUpToDate(DefaultTaskArtifactStateRepository.Java:74)
        at org.gradle.api.internal.tasks.execution.SkipUpToDateTaskExecuter.execute(SkipUpToDateTaskExecuter.Java:53)
        at org.gradle.api.internal.tasks.execution.ValidatingTaskExecuter.execute(ValidatingTaskExecuter.Java:58)
        at org.gradle.api.internal.tasks.execution.SkipEmptySourceFilesTaskExecuter.execute(SkipEmptySourceFilesTaskExecuter.Java:52)
        at org.gradle.api.internal.tasks.execution.SkipTaskWithNoActionsExecuter.execute(SkipTaskWithNoActionsExecuter.Java:52)
        at org.gradle.api.internal.tasks.execution.SkipOnlyIfTaskExecuter.execute(SkipOnlyIfTaskExecuter.Java:53)
        at org.gradle.api.internal.tasks.execution.ExecuteAtMostOnceTaskExecuter.execute(ExecuteAtMostOnceTaskExecuter.Java:43)
        at org.gradle.execution.taskgraph.DefaultTaskGraphExecuter$EventFiringTaskWorker.execute(DefaultTaskGraphExecuter.Java:203)
        at org.gradle.execution.taskgraph.DefaultTaskGraphExecuter$EventFiringTaskWorker.execute(DefaultTaskGraphExecuter.Java:185)
        at org.gradle.execution.taskgraph.AbstractTaskPlanExecutor$TaskExecutorWorker.processTask(AbstractTaskPlanExecutor.Java:66)
        at org.gradle.execution.taskgraph.AbstractTaskPlanExecutor$TaskExecutorWorker.run(AbstractTaskPlanExecutor.Java:50)
        at org.gradle.execution.taskgraph.DefaultTaskPlanExecutor.process(DefaultTaskPlanExecutor.Java:25)
        at org.gradle.execution.taskgraph.DefaultTaskGraphExecuter.execute(DefaultTaskGraphExecuter.Java:110)
        at org.gradle.execution.SelectedTaskExecutionAction.execute(SelectedTaskExecutionAction.Java:37)
        at org.gradle.execution.DefaultBuildExecuter.execute(DefaultBuildExecuter.Java:37)
        at org.gradle.execution.DefaultBuildExecuter.access$000(DefaultBuildExecuter.Java:23)
        at org.gradle.execution.DefaultBuildExecuter$1.proceed(DefaultBuildExecuter.Java:43)
        at org.gradle.execution.DryRunBuildExecutionAction.execute(DryRunBuildExecutionAction.Java:32)
        at org.gradle.execution.DefaultBuildExecuter.execute(DefaultBuildExecuter.Java:37)
        at org.gradle.execution.DefaultBuildExecuter.execute(DefaultBuildExecuter.Java:30)
        at org.gradle.initialization.DefaultGradleLauncher$4.run(DefaultGradleLauncher.Java:153)
        at org.gradle.internal.Factories$1.create(Factories.Java:22)
        at org.gradle.internal.progress.DefaultBuildOperationExecutor.run(DefaultBuildOperationExecutor.Java:91)
        at org.gradle.internal.progress.DefaultBuildOperationExecutor.run(DefaultBuildOperationExecutor.Java:53)
        at org.gradle.initialization.DefaultGradleLauncher.doBuildStages(DefaultGradleLauncher.Java:150)
        at org.gradle.initialization.DefaultGradleLauncher.access$200(DefaultGradleLauncher.Java:32)
        at org.gradle.initialization.DefaultGradleLauncher$1.create(DefaultGradleLauncher.Java:98)
        at org.gradle.initialization.DefaultGradleLauncher$1.create(DefaultGradleLauncher.Java:92)
        at org.gradle.internal.progress.DefaultBuildOperationExecutor.run(DefaultBuildOperationExecutor.Java:91)
        at org.gradle.internal.progress.DefaultBuildOperationExecutor.run(DefaultBuildOperationExecutor.Java:63)
        at org.gradle.initialization.DefaultGradleLauncher.doBuild(DefaultGradleLauncher.Java:92)
        at org.gradle.initialization.DefaultGradleLauncher.run(DefaultGradleLauncher.Java:83)
        at org.gradle.launcher.exec.InProcessBuildActionExecuter$DefaultBuildController.run(InProcessBuildActionExecuter.Java:99)
        at org.gradle.tooling.internal.provider.ExecuteBuildActionRunner.run(ExecuteBuildActionRunner.Java:28)
        at org.gradle.launcher.exec.ChainingBuildActionRunner.run(ChainingBuildActionRunner.Java:35)
        at org.gradle.launcher.exec.InProcessBuildActionExecuter.execute(InProcessBuildActionExecuter.Java:48)
        at org.gradle.launcher.exec.InProcessBuildActionExecuter.execute(InProcessBuildActionExecuter.Java:30)
        at org.gradle.launcher.exec.ContinuousBuildActionExecuter.execute(ContinuousBuildActionExecuter.Java:81)
        at org.gradle.launcher.exec.ContinuousBuildActionExecuter.execute(ContinuousBuildActionExecuter.Java:46)
        at org.gradle.launcher.exec.DaemonUsageSuggestingBuildActionExecuter.execute(DaemonUsageSuggestingBuildActionExecuter.Java:51)
        at org.gradle.launcher.exec.DaemonUsageSuggestingBuildActionExecuter.execute(DaemonUsageSuggestingBuildActionExecuter.Java:28)
        at org.gradle.launcher.cli.RunBuildAction.run(RunBuildAction.Java:43)
        at org.gradle.internal.Actions$RunnableActionAdapter.execute(Actions.Java:173)
        at org.gradle.launcher.cli.CommandLineActionFactory$ParseAndBuildAction.execute(CommandLineActionFactory.Java:239)
        at org.gradle.launcher.cli.CommandLineActionFactory$ParseAndBuildAction.execute(CommandLineActionFactory.Java:212)
        at org.gradle.launcher.cli.JavaRuntimeValidationAction.execute(JavaRuntimeValidationAction.Java:35)
        at org.gradle.launcher.cli.JavaRuntimeValidationAction.execute(JavaRuntimeValidationAction.Java:24)
        at org.gradle.launcher.cli.ExceptionReportingAction.execute(ExceptionReportingAction.Java:33)
        at org.gradle.launcher.cli.ExceptionReportingAction.execute(ExceptionReportingAction.Java:22)
        at org.gradle.launcher.cli.CommandLineActionFactory$WithLogging.execute(CommandLineActionFactory.Java:205)
        at org.gradle.launcher.cli.CommandLineActionFactory$WithLogging.execute(CommandLineActionFactory.Java:169)
        at org.gradle.launcher.Main.doAction(Main.Java:33)
        at org.gradle.launcher.bootstrap.EntryPoint.run(EntryPoint.Java:45)
        at org.gradle.launcher.bootstrap.ProcessBootstrap.runNoExit(ProcessBootstrap.Java:55)
        at org.gradle.launcher.bootstrap.ProcessBootstrap.run(ProcessBootstrap.Java:36)
        at org.gradle.launcher.GradleMain.main(GradleMain.Java:23)
        at org.gradle.wrapper.BootstrapMainStarter.start(BootstrapMainStarter.Java:30)
        at org.gradle.wrapper.WrapperExecutor.execute(WrapperExecutor.Java:127)
        at org.gradle.wrapper.GradleWrapperMain.main(GradleWrapperMain.Java:61)
Caused by: org.gradle.api.UncheckedIOException: Java.io.FileNotFoundException: /home/mohammad/superexnews/metro-bundler-symbolicate117830-24506-1aaqyox.dr9.sock (No such device or address)
        at org.gradle.internal.hash.HashUtil.createHash(HashUtil.Java:39)
        at org.gradle.api.internal.hash.DefaultHasher.hash(DefaultHasher.Java:25)
        at org.gradle.api.internal.changedetection.state.CachingFileSnapshotter.snapshot(CachingFileSnapshotter.Java:82)
        at org.gradle.api.internal.changedetection.state.CachingFileSnapshotter.snapshot(CachingFileSnapshotter.Java:71)
        at org.gradle.api.internal.changedetection.state.CachingFileSnapshotter.snapshot(CachingFileSnapshotter.Java:34)
        at org.gradle.api.internal.changedetection.state.DefaultVisitedTree$1.transform(DefaultVisitedTree.Java:112)
        at org.gradle.api.internal.changedetection.state.DefaultVisitedTree$1.transform(DefaultVisitedTree.Java:104)
        at org.gradle.util.CollectionUtils.collect(CollectionUtils.Java:188)
        at org.gradle.util.CollectionUtils.collect(CollectionUtils.Java:183)
        at org.gradle.api.internal.changedetection.state.DefaultVisitedTree.createTreeSnapshot(DefaultVisitedTree.Java:104)
        at org.gradle.api.internal.changedetection.state.DefaultVisitedTree.maybeCreateSnapshot(DefaultVisitedTree.Java:97)
        at org.gradle.api.internal.changedetection.state.AbstractFileCollectionSnapshotter$1.run(AbstractFileCollectionSnapshotter.Java:71)
        at org.gradle.internal.Factories$1.create(Factories.Java:22)
        at org.gradle.cache.internal.DefaultCacheAccess.useCache(DefaultCacheAccess.Java:192)
        at org.gradle.cache.internal.DefaultCacheAccess.useCache(DefaultCacheAccess.Java:175)
        at org.gradle.cache.internal.DefaultPersistentDirectoryStore.useCache(DefaultPersistentDirectoryStore.Java:106)
        at org.gradle.cache.internal.DefaultCacheFactory$ReferenceTrackingCache.useCache(DefaultCacheFactory.Java:187)
        at org.gradle.api.internal.changedetection.state.DefaultTaskArtifactStateCacheAccess.useCache(DefaultTaskArtifactStateCacheAccess.Java:60)
        at org.gradle.api.internal.changedetection.state.AbstractFileCollectionSnapshotter.snapshot(AbstractFileCollectionSnapshotter.Java:59)
        at org.gradle.api.internal.changedetection.state.DefaultFileCollectionSnapshotter.snapshot(DefaultFileCollectionSnapshotter.Java:30)
        at org.gradle.api.internal.changedetection.rules.AbstractFileSnapshotTaskStateChanges.createSnapshot(AbstractFileSnapshotTaskStateChanges.Java:55)
        ... 73 more
Caused by: Java.io.FileNotFoundException: /home/mohammad/superexnews/metro-bundler-symbolicate117830-24506-1aaqyox.dr9.sock (No such device or address)
        at org.gradle.internal.hash.HashUtil.createHash(HashUtil.Java:34)
        ... 93 more


BUILD FAILED

Total time: 8.509 secs

Ich bin nicht sicher, wie ich das beheben kann. Kann mir jemand sagen, was falsch läuft oder wie ich das beheben kann?

Lassen Sie mich wissen, wenn Sie weitere Informationen benötigen

22
mdash1

Behebung des Problems durch Entfernen des node_modules-Ordners und erneutes Ausführen des npm install-Befehls.

26
LeandroG

Ich habe auch unter diesem Fehler gelitten. Was ich in App> Android Ordner gefunden habe, ist eine Datei mit dem Namen "metro-bundler-symbolicate117830-24506-1aaqyox.dr9.sock" . Ich lösche diese Datei und starte sie 

  ./gradlew assembleRelease 

und es läuft erfolgreich.

6
paritosh raj

Ich hatte einmal diesen Fehler. Was ich getan habe, war gradle sauber, npm neu installieren und das war es.

cd Android
gradlew clean
npm install
react-native run-Android
5

Hatte das gleiche Problem, also habe ich gerade das gradle cd Androidgradlew clean Gesäubert und es hat wie ein Zauber funktioniert.

Kann wegen schlechten Rufs keinen Kommentar abgeben, bitte keine negative Bewertung :)

0
Awais Saifi

Führen Sie diesen Befehl aus, wenn Sie mit Linux arbeiten.

Sudo rm -R metro-symbolicate118829-8699-1t3awul.3lw9.sock

Oder löschen Sie einfach alle Dateien, die sich auf die Metro beziehen. Einige Dateien können nicht gelöscht werden. Daher müssen Sie sie als Administrator löschen.

0